Target
Angiotensin-converting enzyme
Ligand
BDBM50085452
Substrate
Meas. Tech.
ChEMBL_1904292 (CHEMBL4406514)
Ki
14±n/a nM
Citation
 Sharma, UCozier, GESturrock, EDAcharya, KR Molecular Basis for Omapatrilat and Sampatrilat Binding to Neprilysin-Implications for Dual Inhibitor Design with Angiotensin-Converting Enzyme. J Med Chem 63:5488-5500 (2020)  
Target
Name:
Angiotensin-converting enzyme
Synonyms:
ACE Angiotensin converting enzyme (ACE) Angiotensin-converting enzyme, soluble form CD_antigen=CD143 DCP1 Kininase II
Type:
Enzyme
Mol. Mass.:
149709.01
Organism:
Homo sapiens (Human)
Description:
Residue:
1306
  
Inhibitor
Name:
BDBM50085452
Synonyms:
(S)-2-[((S)-6-Amino-2-methanesulfonylamino-hexanoylamino)-methyl]-3-{1-[(S)-1-carboxy-2-(4-hydroxy-phenyl)-ethylcarbamoyl]-cyclopentyl}-propionic acid Sampatrilat
Type:
Small organic molecule
Emp. Form.:
C26H40N4O9S
Mol. Mass.:
584.682
SMILES:
CS(=O)(=O)N[C@@H](CCCCN)C(=O)NC[C@H](CC1(CCCC1)C(=O)N[C@@H](Cc1ccc(O)cc1)C(O)=O)C(O)=O
: