Target
Retinal rod rhodopsin-sensitive cGMP 3',5'-cyclic phosphodiesterase subunit delta
Ligand
BDBM50529737
Substrate
Meas. Tech.
ChEMBL_1909754 (CHEMBL4412200)
IC50
24±n/a nM
Citation
 Chen, DChen, YLian, FChen, LLi, YCao, DWang, XChen, LLi, JMeng, THuang, MGeng, MShen, JZhang, NXiong, B Fragment-based drug discovery of triazole inhibitors to block PDE?-RAS protein-protein interaction. Eur J Med Chem 163:597-609 (2019)  
Target
Name:
Retinal rod rhodopsin-sensitive cGMP 3',5'-cyclic phosphodiesterase subunit delta
Synonyms:
3',5'-cyclic phosphodiesterase PDE6D PDED Retinal rod rhodopsin-sensitive cGMP 3',5'-cyclic phosphodiesterase subunit delta
Type:
PROTEIN
Mol. Mass.:
17418.30
Organism:
Homo sapiens (Human)
Description:
ChEMBL_105761
Residue:
150
  
Inhibitor
Name:
BDBM50529737
Synonyms:
CHEMBL4459864
Type:
Small organic molecule
Emp. Form.:
C31H34N4O3S
Mol. Mass.:
542.692
SMILES:
COc1ccc(CSc2nnc(-c3ccc(OCC(=O)NC4CCCCC4)cc3)n2Cc2ccccc2)cc1
: