Target
Serine--tRNA ligase
Ligand
BDBM50339906
Substrate
Meas. Tech.
ChEMBL_1914052 (CHEMBL4416635)
IC50
230±n/a nM
Citation
 Cain, RSalimraj, RPunekar, ASBellini, DFishwick, CWGCzaplewski, LScott, DJHarris, GDowson, CGLloyd, AJRoper, DI Structure-Guided Enhancement of Selectivity of Chemical Probe Inhibitors Targeting Bacterial Seryl-tRNA Synthetase. J Med Chem 62:9703-9717 (2019)  
Target
Name:
Serine--tRNA ligase
Synonyms:
6.1.1.11 SerRS Seryl-tRNA synthetase serS
Type:
PROTEIN
Mol. Mass.:
48624.87
Organism:
Staphylococcus aureus (strain NCTC 8325 / PS 47)
Description:
ChEMBL_119662
Residue:
428
  
Inhibitor
Name:
BDBM50339906
Synonyms:
((2R,3S,4R,5R)-5-(6-amino-9H-purin-9-yl)-3,4-dihydroxytetrahydrofuran-2-yl)methyl(S)-2-amino-3-hydroxypropanoylsulfamate CHEMBL1163070 | SerSA
Type:
Small organic molecule
Emp. Form.:
C13H19N7O8S
Mol. Mass.:
433.397
SMILES:
N[C@@H](CO)C(=O)NS(=O)(=O)OC[C@H]1O[C@H]([C@H](O)[C@@H]1O)n1cnc2c(N)ncnc12
: