Target
Catechol O-methyltransferase
Ligand
BDBM50479610
Substrate
Meas. Tech.
ChEMBL_1929005 (CHEMBL4432181)
IC50
5.0±n/a nM
Citation
 Silva, TMohamed, TShakeri, ARao, PPMartínez-González, LPérez, DIMartínez, AValente, MJGarrido, JUriarte, ESerrão, PSoares-da-Silva, PRemião, FBorges, F Development of Blood-Brain Barrier Permeable Nitrocatechol-Based Catechol O-Methyltransferase Inhibitors with Reduced Potential for Hepatotoxicity. J Med Chem 59:7584-97 (2016)  
Target
Name:
Catechol O-methyltransferase
Synonyms:
COMT_RAT Catechol-O-methyltransferase | Comt
Type:
Enzyme
Mol. Mass.:
29594.09
Organism:
Rattus norvegicus (Rat)
Description:
Residue:
264
  
Inhibitor
Name:
BDBM50479610
Synonyms:
CHEMBL481644
Type:
Small organic molecule
Emp. Form.:
C17H15NO6
Mol. Mass.:
329.3041
SMILES:
Oc1cc(\C=C\C(=O)OCCc2ccccc2)cc(c1O)[N+]([O-])=O
: