Target
72 kDa type IV collagenase
Ligand
BDBM50090350
Substrate
Meas. Tech.
ChEMBL_104541 (CHEMBL718928)
Ki
4±n/a nM
Citation
 Salvino, JMMathew, RKiesow, TNarensingh, RMason, HJDodd, AGroneberg, RBurns, CJMcGeehan, GKline, JOrton, ETang, SYMorrisette, MLabaudininiere, R Solid-phase synthesis of an arylsulfone hydroxamate library. Bioorg Med Chem Lett 10:1637-40 (2000)  
Target
Name:
72 kDa type IV collagenase
Synonyms:
72 kDa gelatinase CLG4A Gelatinase A (MMP-2) MMP2_HUMAN Matrix metalloproteinase-2 (MMP 2) Matrix metalloproteinases 2 (MMP-2) | TBE-1
Type:
Enzyme
Mol. Mass.:
73870.36
Organism:
Homo sapiens (Human)
Description:
P08253
Residue:
660
  
Inhibitor
Name:
BDBM50090350
Synonyms:
4-Ethyl-3-(4-methoxy-benzenesulfonyl)-octanoic acid hydroxyamide | CHEMBL42040
Type:
Small organic molecule
Emp. Form.:
C17H27NO5S
Mol. Mass.:
357.465
SMILES:
CCCCC(CC)C(CC(=O)NO)S(=O)(=O)c1ccc(OC)cc1
: