Target
Peptide deformylase
Ligand
BDBM50535515
Substrate
Meas. Tech.
ChEMBL_1930891 (CHEMBL4434142)
IC50
2.0±n/a nM
Citation
 Spletstoser, JTDreabit, JKnox, ANBenowitz, ACampobasso, NWard, PCui, GLewandowski, TMcCloskey, LAubart, KM Discovery of piperazic acid peptide deformylase inhibitors with in vivo activity for respiratory tract and skin infections. Bioorg Med Chem Lett 29:2410-2414 (2019)  
Target
Name:
Peptide deformylase
Synonyms:
DEF_STAAM Polypeptide deformylase def1 | pdf1
Type:
Enzyme
Mol. Mass.:
20556.80
Organism:
Staphylococcus aureus
Description:
P68825
Residue:
183
  
Inhibitor
Name:
BDBM50535515
Synonyms:
CHEMBL4559778
Type:
Small organic molecule
Emp. Form.:
C21H31N5O4
Mol. Mass.:
417.5019
SMILES:
Cc1ccnc(NC(=O)[C@@H]2CCCNN2C(=O)[C@H](CC2CCCC2)CN(O)C=O)c1
: