Target
Platelet-activating factor acetylhydrolase
Ligand
BDBM50093951
Substrate
Meas. Tech.
ChEBML_101010
IC50
0.400000±n/a nM
Citation
 Boyd, HFFell, SCFlynn, STHickey, DMIfe, RJLeach, CAMacphee, CHMilliner, KJMoores, KEPinto, ILPorter, RARawlings, DASmith, SAStansfield, IGTew, DGTheobald, CJWhittaker, CM N-1 substituted pyrimidin-4-ones: novel, orally active inhibitors of lipoprotein-associated phospholipase A2. Bioorg Med Chem Lett 10:2557-61 (2001)  
Target
Name:
Platelet-activating factor acetylhydrolase
Synonyms:
1-alkyl-2-acetylglycerophosphocholine esterase LDL-PLA(2) PAF 2-acylhydrolase PAFAH PLA2G7 | Platelet-activating factor acetylhydrolase
Type:
PROTEIN
Mol. Mass.:
50084.41
Organism:
Homo sapiens (Human)
Description:
ChEMBL_156212
Residue:
441
  
Inhibitor
Name:
BDBM50093951
Synonyms:
4-[2-(4-Fluoro-benzylsulfanyl)-4-oxo-5-pyrimidin-5-ylmethyl-4H-pyrimidin-1-yl]-N-octyl-butyramide | CHEMBL421165
Type:
Small organic molecule
Emp. Form.:
C28H36FN5O2S
Mol. Mass.:
525.681
SMILES:
CCCCCCCCNC(=O)CCCn1cc(Cc2cncnc2)c(=O)nc1SCc1ccc(F)cc1
: