Target
Peroxisome proliferator-activated receptor gamma
Ligand
BDBM50301375
Substrate
Meas. Tech.
ChEMBL_1995677 (CHEMBL4629572)
EC50
12000±n/a nM
Citation
 Gellrich, LHeitel, PHeering, JKilu, WPollinger, JGoebel, TKahnt, AArifi, SPogoda, WPaulke, ASteinhilber, DProschak, EWurglics, MSchubert-Zsilavecz, MChaikuad, AKnapp, SBischoff, IFürst, RMerk, D l-Thyroxin and the Nonclassical Thyroid Hormone TETRAC Are Potent Activators of PPAR?. J Med Chem 63:6727-6740 (2020)  
Target
Name:
Peroxisome proliferator-activated receptor gamma
Synonyms:
NR1C3 PPAR-gamma PPARG_HUMAN Peroxisome proliferator-activated receptor gamma (PPAR gamma) Peroxisome proliferator-activated receptor gamma (PPARγ) peroxisome proliferator-activated receptor gamma isoform 2
Type:
Nuclear Receptor
Mol. Mass.:
57613.46
Organism:
Homo sapiens (Human)
Description:
P37231
Residue:
505
  
Inhibitor
Name:
BDBM50301375
Synonyms:
3,3',5,5'-tetraiodo-L-thyronine 4-(4-hydroxy-3,5-diiodophenoxy)-3,5-diiodo-L-phenylalanine L-T4 O-(4-hydroxy-3,5-diiodophenyl)-3,5-diiodo-L-tyrosine | levothyroxine
Type:
Small organic molecule
Emp. Form.:
C15H11I4NO4
Mol. Mass.:
776.87
SMILES:
N[C@@H](Cc1cc(I)c(Oc2cc(I)c(O)c(I)c2)c(I)c1)C(O)=O
: