Target
Methylated-DNA--protein-cysteine methyltransferase
Ligand
BDBM50106513
Substrate
Meas. Tech.
ChEMBL_103719 (CHEMBL712287)
IC50
450±n/a nM
Citation
 Reinhard, JHull, WEvon der Lieth, CWEichhorn, UKliem, HCKaina, BWiessler, M Monosaccharide-linked inhibitors of O(6)-methylguanine-DNA methyltransferase (MGMT): synthesis, molecular modeling, and structure-activity relationships. J Med Chem 44:4050-61 (2001)  
Target
Name:
Methylated-DNA--protein-cysteine methyltransferase
Synonyms:
6-O-methylguanine-DNA methyltransferase MGMT_HUMAN
Type:
PROTEIN
Mol. Mass.:
21651.27
Organism:
Homo sapiens (Human)
Description:
ChEMBL_144711
Residue:
207
  
Inhibitor
Name:
BDBM50106513
Synonyms:
2-{4-[2-Amino-6-(4-bromo-thiophen-2-ylmethoxy)-purin-9-yl]-butoxy}-6-hydroxymethyl-tetrahydro-pyran-3,4,5-triol | CHEMBL134079
Type:
Small organic molecule
Emp. Form.:
C20H26BrN5O7S
Mol. Mass.:
560.419
SMILES:
Nc1nc(OCc2cc(Br)cs2)c2ncn(CCCCO[C@H]3OC(CO)[C@@H](O)[C@@H](O)C3O)c2n1
: