Target
Platelet-activating factor acetylhydrolase
Ligand
BDBM50107481
Substrate
Meas. Tech.
ChEBML_101009
IC50
0.500000±n/a nM
Citation
 Boyd, HFFell, SCHickey, DMIfe, RJLeach, CAMacphee, CHMilliner, KJPinto, ILRawlings, DASmith, SAStansfield, IGStanway, SJTheobald, CJWhittaker, CM Potent, orally active inhibitors of lipoprotein-associated phospholipase A(2): 1-(biphenylmethylamidoalkyl)-pyrimidones. Bioorg Med Chem Lett 12:51-5 (2001)  
Target
Name:
Platelet-activating factor acetylhydrolase
Synonyms:
1-alkyl-2-acetylglycerophosphocholine esterase LDL-PLA(2) PAF 2-acylhydrolase PAFAH PLA2G7 | Platelet-activating factor acetylhydrolase
Type:
PROTEIN
Mol. Mass.:
50084.41
Organism:
Homo sapiens (Human)
Description:
ChEMBL_156212
Residue:
441
  
Inhibitor
Name:
BDBM50107481
Synonyms:
CHEMBL153546 | N-(4'-Bromo-biphenyl-4-ylmethyl)-2-[2-(4-fluoro-benzylsulfanyl)-5-(1-methyl-1H-pyrazol-4-ylmethyl)-4-oxo-4H-pyrimidin-1-yl]-N-methyl-acetamide
Type:
Small organic molecule
Emp. Form.:
C32H29BrFN5O2S
Mol. Mass.:
646.572
SMILES:
CN(Cc1ccc(cc1)-c1ccc(Br)cc1)C(=O)Cn1cc(Cc2cnn(C)c2)c(=O)nc1SCc1ccc(F)cc1
: