Target
Acetylcholinesterase
Ligand
BDBM10404
Substrate
Meas. Tech.
ChEBML_27794
IC50
360±n/a nM
Citation
 Trujillo-Ferrara, JMontoya Cano, LEspinoza-Fonseca, M Synthesis, anticholinesterase activity and structure-activity relationships of m-Aminobenzoic acid derivatives. Bioorg Med Chem Lett 13:1825-7 (2003)  
Target
Name:
Acetylcholinesterase
Synonyms:
3.1.1.7 Acetylcholinesterase (AChE) ache
Type:
Mol. Mass.:
65900.74
Organism:
Tetronarce californica (Pacific electric ray) (Torpedo californica)
Description:
P04058
Residue:
586
  
Inhibitor
Name:
BDBM10404
Synonyms:
(1S,12S,14R)-9-methoxy-4-methyl-11-oxa-4-azatetracyclo[8.6.1.0^{1,12}.0^{6,17}]heptadeca-6,8,10(17),15-tetraen-14-ol GALANTAMINE HYDROBROMIDE Galanthamine Lycoremine Nivaline Reminyl US9586925, Galantamine | galantamine
Type:
Small organic molecule
Emp. Form.:
C17H21NO3
Mol. Mass.:
287.3535
SMILES:
COc1ccc2CN(C)CC[C@@]34C=C[C@H](O)C[C@@H]3Oc1c24
: