Target
Estrogen receptor beta
Ligand
BDBM17292
Substrate
Meas. Tech.
ChEMBL_67811 (CHEMBL676380)
IC50
1.1±n/a nM
Citation
 Kim, SWu, JYBirzin, ETFrisch, KChan, WPai, LYYang, YTMosley, RTFitzgerald, PMSharma, NDahllund, JThorsell, AGDiNinno, FRohrer, SPSchaeffer, JMHammond, ML Estrogen receptor ligands. II. Discovery of benzoxathiins as potent, selective estrogen receptor alpha modulators. J Med Chem 47:2171-5 (2004)  
Target
Name:
Estrogen receptor beta
Synonyms:
ER-beta ESR2_HUMAN Estradiol receptor beta (ERβ) Estrogen receptor (ER beta) Estrogen receptor beta (ER beta) NR3A2 estrogen beta
Type:
Protein
Mol. Mass.:
59238.43
Organism:
Homo sapiens (Human)
Description:
Q92731
Residue:
530
  
Inhibitor
Name:
BDBM17292
Synonyms:
(1S,10R,11S,14S,15S)-15-methyltetracyclo[8.7.0.0^{2,7}.0^{11,15}]heptadeca-2,4,6-triene-5,14-diol 17α-ethinylestradiol CHEMBL135 ESTRADIOL Ovocyclin US9040509, E2 US9561238, E2 [2,4,6,7-3H]-E2 [3H]]estradiol
Type:
Steroid
Emp. Form.:
C18H24O2
Mol. Mass.:
272.382
SMILES:
[H][C@@]12CC[C@H](O)[C@@]1(C)CC[C@]1([H])c3ccc(O)cc3CC[C@@]21[H]
: