Target
5-hydroxytryptamine receptor 7
Ligand
BDBM50150682
Substrate
Meas. Tech.
ChEMBL_303365 (CHEMBL839683)
Ki
6.46±n/a nM
Citation
 Holmberg, PSohn, DLeideborg, RCaldirola, PZlatoidsky, PHanson, SMohell, NRosqvist, SNordvall, GJohansson, AMJohansson, R Novel 2-aminotetralin and 3-aminochroman derivatives as selective serotonin 5-HT7 receptor agonists and antagonists. J Med Chem 47:3927-30 (2004)  
Target
Name:
5-hydroxytryptamine receptor 7
Synonyms:
5-HT-7 5-HT7 5-HT7S 5-hydroxytryptamine receptor 7 5HT7R_RAT GPRFO Serotonin (5-HT) receptor | Serotonin Receptor 7
Type:
G Protein-Coupled Receptor (GPCR)
Mol. Mass.:
49852.62
Organism:
Rattus norvegicus (rat)
Description:
Rat cloned 5-HT7R.
Residue:
448
  
Inhibitor
Name:
BDBM50150682
Synonyms:
2a-[4-(6,7-Dihydro-4H-thieno[3,2-c]pyridin-5-yl)-butyl]-2a,3,4,5-tetrahydro-1H-benzo[cd]indol-2-one | CHEMBL314055
Type:
Small organic molecule
Emp. Form.:
C22H26N2OS
Mol. Mass.:
366.52
SMILES:
O=C1Nc2cccc3CCCC1(CCCCN1CCc4sccc4C1)c23
: