Target
5-hydroxytryptamine receptor 7
Ligand
BDBM50150685
Substrate
Meas. Tech.
ChEMBL_303365 (CHEMBL839683)
Ki
3.38±n/a nM
Citation
 Holmberg, PSohn, DLeideborg, RCaldirola, PZlatoidsky, PHanson, SMohell, NRosqvist, SNordvall, GJohansson, AMJohansson, R Novel 2-aminotetralin and 3-aminochroman derivatives as selective serotonin 5-HT7 receptor agonists and antagonists. J Med Chem 47:3927-30 (2004)  
Target
Name:
5-hydroxytryptamine receptor 7
Synonyms:
5-HT-7 5-HT7 5-HT7S 5-hydroxytryptamine receptor 7 5HT7R_RAT GPRFO Serotonin (5-HT) receptor | Serotonin Receptor 7
Type:
G Protein-Coupled Receptor (GPCR)
Mol. Mass.:
49852.62
Organism:
Rattus norvegicus (rat)
Description:
Rat cloned 5-HT7R.
Residue:
448
  
Inhibitor
Name:
BDBM50150685
Synonyms:
((S)-5-Phenyl-1,2,3,4-tetrahydro-naphthalen-2-yl)-dipropyl-amine CHEMBL362540
Type:
Small organic molecule
Emp. Form.:
C22H29N
Mol. Mass.:
307.4724
SMILES:
CCCN(CCC)[C@H]1CCc2c(C1)cccc2-c1ccccc1
: