Target
Estrogen receptor
Ligand
BDBM50157163
Substrate
Meas. Tech.
ChEMBL_305993 (CHEMBL832667)
IC50
1±n/a nM
Citation
 Blizzard, TADininno, FMorgan, JDChen, HYWu, JYKim, SChan, WBirzin, ETYang, YTPai, LYFitzgerald, PMSharma, NLi, YZhang, ZHayes, ECDasilva, CATang, WRohrer, SPSchaeffer, JMHammond, ML Estrogen receptor ligands. Part 9: Dihydrobenzoxathiin SERAMs with alkyl substituted pyrrolidine side chains and linkers. Bioorg Med Chem Lett 15:107-13 (2004)  
Target
Name:
Estrogen receptor
Synonyms:
ER ESR ESR1_HUMAN Estrogen receptor Estrogen receptor (ER-alpha) Estrogen receptor alpha (ER) Nuclear receptor subfamily 3 group A member 1
Type:
Protein
Mol. Mass.:
66230.44
Organism:
Homo sapiens (Human)
Description:
P03372
Residue:
595
  
Inhibitor
Name:
BDBM50157163
Synonyms:
(2S,3R)-3-(4-Hydroxy-phenyl)-2-{4-[2-((S)-3-methyl-pyrrolidin-1-yl)-ethoxy]-phenyl}-2,3-dihydro-benzo[1,4]oxathiin-6-ol | CHEMBL183049
Type:
Small organic molecule
Emp. Form.:
C27H29NO4S
Mol. Mass.:
463.588
SMILES:
C[C@H]1CCN(CCOc2ccc(cc2)[C@@H]2Oc3ccc(O)cc3S[C@@H]2c2ccc(O)cc2)C1
: