Target
3-hydroxy-3-methylglutaryl-coenzyme A reductase
Ligand
BDBM50160720
Substrate
Meas. Tech.
ChEMBL_302634 (CHEMBL839925)
Ki
23.5±n/a nM
Citation
 Medina-Franco, JLLópez-Vallejo, FRodríguez-Morales, SCastillo, RChamorro, GTamariz, J Molecular docking of the highly hypolipidemic agent alpha-asarone with the catalytic portion of HMG-CoA reductase. Bioorg Med Chem Lett 15:989-94 (2005)  
Target
Name:
3-hydroxy-3-methylglutaryl-coenzyme A reductase
Synonyms:
3-hydroxy-3-methylglutaryl-coenzyme A (HMG-CoA) reductase HMDH_HUMAN HMG-CoA reductase (HMGR) | HMGCR
Type:
Enzyme
Mol. Mass.:
97477.10
Organism:
Homo sapiens (Human)
Description:
P04035
Residue:
888
  
Inhibitor
Name:
BDBM50160720
Synonyms:
3-hydroxy-3-methylglutaric acid CHEMBL50444 meglutol
Type:
Small organic molecule
Emp. Form.:
C6H10O5
Mol. Mass.:
162.1406
SMILES:
CC(O)(CC(O)=O)CC(O)=O
: