Target
Oxysterols receptor LXR-beta
Ligand
BDBM50172190
Substrate
Meas. Tech.
ChEMBL_321114 (CHEMBL882880)
EC50
>50000±n/a nM
Citation
 Liu, WChen, SDropinski, JColwell, LRobins, MSzymonifka, MHayes, NSharma, NMacNaul, KHernandez, MBurton, CSparrow, CPMenke, JGSingh, SB Design, synthesis, and structure-activity relationship of podocarpic acid amides as liver X receptor agonists for potential treatment of atherosclerosis. Bioorg Med Chem Lett 15:4574-8 (2005)  
Target
Name:
Oxysterols receptor LXR-beta
Synonyms:
LXRB Liver X, LXR beta NR1H2 Nuclear receptor NER Ubiquitously-expressed nuclear receptor
Type:
Enzyme Catalytic Domain
Mol. Mass.:
50978.79
Organism:
Homo sapiens (Human)
Description:
P55055
Residue:
460
  
Inhibitor
Name:
BDBM50172190
Synonyms:
(4S,4aR)-6-Hydroxy-4a-methyl-1-(S)-methyl-1,2,3,4,4a,9,10,10a-octahydro-phenanthrene-1-carboxylic acid ((1R,2R,3R,5S)-2,6,6-trimethyl-bicyclo[3.1.1]hept-3-yl)-amide | CHEMBL382942
Type:
Small organic molecule
Emp. Form.:
C27H39NO2
Mol. Mass.:
409.6041
SMILES:
C[C@@H]1[C@H]2C[C@@H](C[C@H]1NC(=O)[C@@]1(C)CCC[C@@]3(C)[C@H]1CCc1ccc(O)cc31)C2(C)C
: