Target
Oxysterols receptor LXR-alpha
Ligand
BDBM50172204
Substrate
Meas. Tech.
ChEMBL_321183 (CHEMBL882912)
IC50
50±n/a nM
Citation
 Liu, WChen, SDropinski, JColwell, LRobins, MSzymonifka, MHayes, NSharma, NMacNaul, KHernandez, MBurton, CSparrow, CPMenke, JGSingh, SB Design, synthesis, and structure-activity relationship of podocarpic acid amides as liver X receptor agonists for potential treatment of atherosclerosis. Bioorg Med Chem Lett 15:4574-8 (2005)  
Target
Name:
Oxysterols receptor LXR-alpha
Synonyms:
LXRA Liver X receptor alpha Liver X receptor alpha (NR1H3) NR1H3 Nuclear orphan receptor LXR-alpha | Nuclear receptor subfamily 1 group H member 3
Type:
Enzyme Catalytic Domain
Mol. Mass.:
50403.85
Organism:
Homo sapiens (Human)
Description:
Q13133
Residue:
447
  
Inhibitor
Name:
BDBM50172204
Synonyms:
(1S,4aS,10aR)-6-Hydroxy-1,4a-dimethyl-1,2,3,4,4a,9,10,10a-octahydro-phenanthrene-1-carboxylic acid (1-phenyl-cyclohexylmethyl)-amide | CHEMBL372612
Type:
Small organic molecule
Emp. Form.:
C30H39NO2
Mol. Mass.:
445.6362
SMILES:
C[C@@]1(CCC[C@@]2(C)[C@H]1CCc1ccc(O)cc21)C(=O)NCC1(CCCCC1)c1ccccc1
: