Target
Histone deacetylase 2b
Ligand
BDBM50173893
Substrate
Meas. Tech.
ChEMBL_322291 (CHEMBL885046)
IC50
35±n/a nM
Citation
 Mai, AMassa, SRotili, DPezzi, RBottoni, PScatena, RMeraner, JBrosch, G Exploring the connection unit in the HDAC inhibitor pharmacophore model: novel uracil-based hydroxamates. Bioorg Med Chem Lett 15:4656-61 (2005)  
Target
Name:
Histone deacetylase 2b
Synonyms:
Histone deacetylase HD2
Type:
PROTEIN
Mol. Mass.:
30785.07
Organism:
Zea mays
Description:
ChEMBL_87549
Residue:
286
  
Inhibitor
Name:
BDBM50173893
Synonyms:
6-[4-(2-Ethyl-phenyl)-6-oxo-1,6-dihydro-pyrimidin-2-ylsulfanyl]-hexanoic acid hydroxyamide | CHEMBL373049
Type:
Small organic molecule
Emp. Form.:
C18H23N3O3S
Mol. Mass.:
361.459
SMILES:
CCc1ccccc1-c1cc(=O)[nH]c(SCCCCCC(=O)NO)n1
: