Target
Histone deacetylase 2b
Ligand
BDBM50234114
Substrate
Meas. Tech.
ChEMBL_322291 (CHEMBL885046)
IC50
18±n/a nM
Citation
 Mai, AMassa, SRotili, DPezzi, RBottoni, PScatena, RMeraner, JBrosch, G Exploring the connection unit in the HDAC inhibitor pharmacophore model: novel uracil-based hydroxamates. Bioorg Med Chem Lett 15:4656-61 (2005)  
Target
Name:
Histone deacetylase 2b
Synonyms:
Histone deacetylase HD2
Type:
PROTEIN
Mol. Mass.:
30785.07
Organism:
Zea mays
Description:
ChEMBL_87549
Residue:
286
  
Inhibitor
Name:
BDBM50234114
Synonyms:
6-(4-Benzyl-6-oxo-1,6-dihydro-pyrimidin-2-ylsulfanyl)-hexanoic acid hydroxyamide CHEMBL218027 | N-hydroxy-6-(3,4-dihydro-4-oxo-6-benzyl-2-pyrimidinylthio)hexanamide
Type:
Small organic molecule
Emp. Form.:
C17H21N3O3S
Mol. Mass.:
347.432
SMILES:
ONC(=O)CCCCCSc1nc(Cc2ccccc2)cc(=O)[nH]1
: