Target
Estrogen receptor
Ligand
BDBM50174927
Substrate
Meas. Tech.
ChEMBL_325824 (CHEMBL863236)
IC50
0.5±n/a nM
Citation
 Blizzard, TAMorgan, JDChan, WBirzin, ETPai, LYHayes, ECDaSilva, CAMosley, RTYang, YTRohrer, SPDininno, FHammond, ML Estrogen receptor ligands. Part 14: application of novel antagonist side chains to existing platforms. Bioorg Med Chem Lett 15:5124-8 (2005)  
Target
Name:
Estrogen receptor
Synonyms:
ER ESR ESR1_HUMAN Estrogen receptor Estrogen receptor (ER-alpha) Estrogen receptor alpha (ER) Nuclear receptor subfamily 3 group A member 1
Type:
Protein
Mol. Mass.:
66230.44
Organism:
Homo sapiens (Human)
Description:
P03372
Residue:
595
  
Inhibitor
Name:
BDBM50174927
Synonyms:
(R)-1-(4-(2-(3-methylpyrrolidin-1-yl)ethoxy)benzyl)-2-(4-hydroxyphenyl)-3-methyl-1H-indol-5-ol | CHEMBL198914
Type:
Small organic molecule
Emp. Form.:
C29H32N2O3
Mol. Mass.:
456.576
SMILES:
C[C@@H]1CCN(CCOc2ccc(Cn3c(c(C)c4cc(O)ccc34)-c3ccc(O)cc3)cc2)C1
: