Target
Cannabinoid receptor 1
Ligand
BDBM50176417
Substrate
Meas. Tech.
ChEMBL_333260 (CHEMBL859079)
Ki
20±n/a nM
Citation
 Carpino, PAGriffith, DASakya, SDow, RLBlack, SCHadcock, JRIredale, PAScott, DOFichtner, MWRose, CRDay, RDibrino, JButler, MDebartolo, DBDutcher, DGautreau, DLizano, JSO'connor, RESands, MAKelly-Sullivan, DWard, KM New bicyclic cannabinoid receptor-1 (CB1-R) antagonists. Bioorg Med Chem Lett 16:731-6 (2005)  
Target
Name:
Cannabinoid receptor 1
Synonyms:
CANN6 CB-R CNR CNR1_HUMAN Cannabinoid receptor Cannabinoid receptor 1 (brain)
Type:
G Protein-Coupled Receptor (GPCR)
Mol. Mass.:
52868.96
Organism:
Homo sapiens (Human)
Description:
P21554
Residue:
472
  
Inhibitor
Name:
BDBM50176417
Synonyms:
2-(2-chlorophenyl)-3-(4-chlorophenyl)-6-cyclohexyl-2H-pyrazolo[4,3-d]pyrimidin-7(6H)-one | CHEMBL370560
Type:
Small organic molecule
Emp. Form.:
C23H20Cl2N4O
Mol. Mass.:
439.337
SMILES:
Clc1ccc(cc1)-c1n(nc2c1ncn(C1CCCCC1)c2=O)-c1ccccc1Cl
: