Target
Alpha-1D adrenergic receptor
Ligand
BDBM50183677
Substrate
Meas. Tech.
ChEMBL_350832 (CHEMBL869686)
EC50
5400±n/a nM
Citation
 del Olmo, EBarboza, BYbarra, MILópez-Pérez, JLCarrón, RSevilla, MABoselli, CSan Feliciano, A Vasorelaxant activity of phthalazinones and related compounds. Bioorg Med Chem Lett 16:2786-90 (2006)  
Target
Name:
Alpha-1D adrenergic receptor
Synonyms:
ADA1D_RAT Adra1d Alpha-1D adrenergic receptor | Serotonin 1a (5-HT1a) receptor/Adrenergic receptor alpha-1
Type:
Protein
Mol. Mass.:
59375.97
Organism:
Rattus norvegicus (Rat)
Description:
P23944
Residue:
561
  
Inhibitor
Name:
BDBM50183677
Synonyms:
4-(3,4-dimethoxybenzyl)-2-butylphthalazin-1(2H)-one | CHEMBL379270
Type:
Small organic molecule
Emp. Form.:
C21H24N2O3
Mol. Mass.:
352.4269
SMILES:
CCCCn1nc(Cc2ccc(OC)c(OC)c2)c2ccccc2c1=O
: