Target
RNA-directed RNA polymerase
Ligand
BDBM50187231
Substrate
Meas. Tech.
ChEMBL_356302 (CHEMBL869357)
IC50
7900±n/a nM
Citation
 Gopalsamy, AChopra, RLim, KCiszewski, GShi, MCurran, KJSukits, SFSvenson, KBard, JEllingboe, JWAgarwal, AKrishnamurthy, GHowe, AYOrlowski, MFeld, BO'Connell, JMansour, TS Discovery of proline sulfonamides as potent and selective hepatitis C virus NS5b polymerase inhibitors. Evidence for a new NS5b polymerase binding site. J Med Chem 49:3052-5 (2006)  
Target
Name:
RNA-directed RNA polymerase
Synonyms:
Hepatitis C virus NS5B RNA-dependent RNA polymerase | NS5B protein
Type:
Protein
Mol. Mass.:
25173.95
Organism:
Hepatitis C virus
Description:
Q8JXU8
Residue:
229
  
Inhibitor
Name:
BDBM50187231
Synonyms:
(R)-1-(3,5-dichloro-2-hydroxyphenylsulfonyl)pyrrolidine-2-carboxylic acid | CHEMBL380182
Type:
Small organic molecule
Emp. Form.:
C11H11Cl2NO5S
Mol. Mass.:
340.18
SMILES:
OC(=O)[C@H]1CCCN1S(=O)(=O)c1cc(Cl)cc(Cl)c1O
: