Target
Cycloartenol-C-24-methyltransferase
Ligand
BDBM50195627
Substrate
Meas. Tech.
ChEMBL_415083 (CHEMBL912398)
IC50
1760±n/a nM
Citation
 Gros, LLorente, SOJimenez, CJYardley, VRattray, LWharton, HLittle, SCroft, SLRuiz-Perez, LMGonzalez-Pacanowska, DGilbert, IH Evaluation of azasterols as anti-parasitics. J Med Chem 49:6094-103 (2006)  
Target
Name:
Cycloartenol-C-24-methyltransferase
Synonyms:
24-sterol C-methyltransferase SMT1 | SMT1_ARATH
Type:
PROTEIN
Mol. Mass.:
38266.01
Organism:
Arabidopsis thaliana
Description:
ChEMBL_415082
Residue:
336
  
Inhibitor
Name:
BDBM50195627
Synonyms:
22,26-azasterol | CHEMBL425634
Type:
Small organic molecule
Emp. Form.:
C26H45NO2
Mol. Mass.:
403.641
SMILES:
C[C@@](O)([C@H]1CC[C@H]2C3CC[C@H]4C[C@@H](O)CC[C@]4(C)[C@H]3CC[C@]12C)C1CCCCN1
: