Target
Cycloartenol-C-24-methyltransferase
Ligand
BDBM50195630
Substrate
Meas. Tech.
ChEMBL_415082 (CHEMBL912396)
IC50
>100000±n/a nM
Citation
 Gros, LLorente, SOJimenez, CJYardley, VRattray, LWharton, HLittle, SCroft, SLRuiz-Perez, LMGonzalez-Pacanowska, DGilbert, IH Evaluation of azasterols as anti-parasitics. J Med Chem 49:6094-103 (2006)  
Target
Name:
Cycloartenol-C-24-methyltransferase
Synonyms:
24-sterol C-methyltransferase SMT1 | SMT1_ARATH
Type:
PROTEIN
Mol. Mass.:
38266.01
Organism:
Arabidopsis thaliana
Description:
ChEMBL_415082
Residue:
336
  
Inhibitor
Name:
BDBM50195630
Synonyms:
3beta-acetoxy-23,24-bisnor-5-en-22-(6-(2-Z-amino)benzyl hexanoate) amide | CHEMBL217116
Type:
Small organic molecule
Emp. Form.:
C45H60N2O7
Mol. Mass.:
740.9671
SMILES:
C[C@@H]([C@H]1CC[C@H]2C3CC=C4C[C@H](CC[C@]4(C)[C@H]3CC[C@]12C)OC(C)=O)C(=O)NCCCC[C@H](NC(=O)OCc1ccccc1)C(=O)OCc1ccccc1
: