Target
5-hydroxytryptamine receptor 2A
Ligand
BDBM50203397
Substrate
Meas. Tech.
ChEMBL_441843 (CHEMBL890994)
Ki
158±n/a nM
Citation
 Carato, PGraulich, AJensen, NRoth, BLLiégeois, JF Synthesis and in vitro binding studies of substituted piperidine naphthamides. Part II: Influence of the substitution on the benzyl moiety on the affinity for D2L, D4.2, and 5-HT2A receptors. Bioorg Med Chem Lett 17:1570-4 (2007)  
Target
Name:
5-hydroxytryptamine receptor 2A
Synonyms:
5-HT-2A 5-HT2A 5-hydroxytryptamine receptor 2A (5HT2A) Htr2 Serotonin Receptor 2A
Type:
G Protein-Coupled Receptor (GPCR)
Mol. Mass.:
52852.05
Organism:
Rattus norvegicus (rat)
Description:
Rat cortex membranes 5-HT2A receptors.
Residue:
471
  
Inhibitor
Name:
BDBM50203397
Synonyms:
CHEMBL234645 | N-(1-(3-methoxybenzyl)piperidin-4-yl)-2-naphthamide
Type:
Small organic molecule
Emp. Form.:
C24H26N2O2
Mol. Mass.:
374.4754
SMILES:
COc1cccc(CN2CCC(CC2)NC(=O)c2ccc3ccccc3c2)c1
: