Target
D(2) dopamine receptor
Ligand
BDBM50203375
Substrate
Meas. Tech.
ChEMBL_438240 (CHEMBL887349)
Ki
>1000±n/a nM
Citation
 Carato, PGraulich, AJensen, NRoth, BLLiégeois, JF Synthesis and in vitro binding studies of substituted piperidine naphthamides. Part I: Influence of the substitution on the basic nitrogen and the position of the amide on the affinity for D2L, D4.2, and 5-HT2A receptors. Bioorg Med Chem Lett 17:1565-9 (2007)  
Target
Name:
D(2) dopamine receptor
Synonyms:
D(2) dopamine receptor DOPAMINE D2 Long DRD2 Dopamine D2 receptor Dopamine D2 receptor (D2R) Dopamine2-like | d2
Type:
Cell-surface receptors
Mol. Mass.:
50647.10
Organism:
Homo sapiens (Human)
Description:
P14416
Residue:
443
  
Inhibitor
Name:
BDBM50203375
Synonyms:
CHEMBL229019 N-(1-benzylpiperidine-4-yl)-1-naphthamide
Type:
Small organic molecule
Emp. Form.:
C23H24N2O
Mol. Mass.:
344.4495
SMILES:
O=C(NC1CCN(Cc2ccccc2)CC1)c1cccc2ccccc12
: