Target
Estrogen receptor
Ligand
BDBM50204800
Substrate
Meas. Tech.
ChEMBL_454488 (CHEMBL886514)
IC50
8±n/a nM
Citation
 Dykstra, KDGuo, LBirzin, ETChan, WYang, YTHayes, ECDaSilva, CAPai, LYMosley, RTKraker, BFitzgerald, PMDiNinno, FRohrer, SPSchaeffer, JMHammond, ML Estrogen receptor ligands. Part 16: 2-Aryl indoles as highly subtype selective ligands for ERalpha. Bioorg Med Chem Lett 17:2322-8 (2007)  
Target
Name:
Estrogen receptor
Synonyms:
ER ESR ESR1_HUMAN Estrogen receptor Estrogen receptor (ER-alpha) Estrogen receptor alpha (ER) Nuclear receptor subfamily 3 group A member 1
Type:
Protein
Mol. Mass.:
66230.44
Organism:
Homo sapiens (Human)
Description:
P03372
Residue:
595
  
Inhibitor
Name:
BDBM50204800
Synonyms:
(R)-N-(4-(4-hydroxyphenyl)butan-2-yl)-2-(2-phenyl-6-(2-(piperidin-1-yl)ethoxy)-1H-indol-3-yl)acetamide N-[(1R)-3-(4-HYDROXYPHENYL)-1-METHYLPROPYL]-2-[2-PHENYL-6-(2-PIPERIDIN-1-YLETHOXY)-1H-INDOL-3-YL]ACETAMIDE
Type:
Small organic molecule
Emp. Form.:
C33H39N3O3
Mol. Mass.:
525.6811
SMILES:
C[C@H](CCc1ccc(O)cc1)NC(=O)Cc1c([nH]c2cc(OCCN3CCCCC3)ccc12)-c1ccccc1
: