Target
Beta-3 adrenergic receptor
Ligand
BDBM50106829
Substrate
Meas. Tech.
ChEMBL_456291 (CHEMBL888301)
Ki
21±n/a nM
Citation
 Washburn, WNHarper, TWWu, GGodfrey, JDMcCann, PGirotra, RShao, CZhang, HGavai, AMikkilineni, ADejneka, TAhmed, SCaringal, YHangeland, JZhang, MCheng, PTRussell, ADSkwish, SSlusarchyk, DAAllen, GTFrohlich, BHAbboa-Offei, BECap, MWaldron, TLGeorge, RJTesfamariam, BDickinson, KESeymour, AASher, PM Arylpropanolamines: selective beta3 agonists arising from strategies to mitigate phase I metabolic transformations. Bioorg Med Chem Lett 17:4290-6 (2007)  
Target
Name:
Beta-3 adrenergic receptor
Synonyms:
ADRB3 ADRB3_HUMAN Beta-2 adrenergic receptor and beta-3 adrenergic receptor Beta-3 adrenoreceptor | adrenergic Beta3
Type:
G Protein-Coupled Receptor (GPCR)
Mol. Mass.:
43534.88
Organism:
Homo sapiens (Human)
Description:
Residue:
408
  
Inhibitor
Name:
BDBM50106829
Synonyms:
BMS-196085 N-(5-((R)-2-((R)-1-(4-(difluoromethoxy)phenyl)-2-phenylethylamino)-1-hydroxyethyl)-2-hydroxyphenyl)methanesulfonamide | N-(5-{(R)-2-[(R)-1-(4-Difluoromethoxy-phenyl)-2-phenyl-ethylamino]-1-hydroxy-ethyl}-2-hydroxy-phenyl)-methanesulfonamide
Type:
Small organic molecule
Emp. Form.:
C24H26F2N2O5S
Mol. Mass.:
492.535
SMILES:
CS(=O)(=O)Nc1cc(ccc1O)[C@@H](O)CN[C@H](Cc1ccccc1)c1ccc(OC(F)F)cc1
: