Target
Kinesin-like protein KIF11
Ligand
BDBM50220182
Substrate
Meas. Tech.
ChEMBL_446063 (CHEMBL895158)
Ki
6.2±n/a nM
Citation
Target
Name:
Kinesin-like protein KIF11
Synonyms:
EG5 KIF11_HUMAN Kinesin Spindle Protein Eg5 TRIP5 | kinesin spindle protein
Type:
PROTEIN
Mol. Mass.:
119138.97
Organism:
Homo sapiens (Human)
Description:
ChEMBL_1457426
Residue:
1056
  
Inhibitor
Name:
BDBM50220182
Synonyms:
CHEMBL390629 | N-[4'-(trifluoromethyl)-4-biphenylyl]sulfamide
Type:
Small organic molecule
Emp. Form.:
C13H11F3N2O2S
Mol. Mass.:
316.299
SMILES:
NS(=O)(=O)Nc1ccc(cc1)-c1ccc(cc1)C(F)(F)F
: