Target
Oxysterols receptor LXR-beta
Ligand
BDBM50172185
Substrate
Meas. Tech.
ChEMBL_551129 (CHEMBL1007710)
EC50
>50000±n/a nM
Citation
 Jayasuriya, HHerath, KBOndeyka, JGGuan, ZBorris, RPTiwari, Sde Jong, WChavez, FMoss, JStevenson, DWBeck, HTSlattery, MZamora, NSchulman, MAli, ASharma, NMacNaul, KHayes, NMenke, JGSingh, SB Diterpenoid, steroid, and triterpenoid agonists of liver X receptors from diversified terrestrial plants and marine sources. J Nat Prod 68:1247-52 (2005)  
Target
Name:
Oxysterols receptor LXR-beta
Synonyms:
LXRB Liver X, LXR beta NR1H2 Nuclear receptor NER Ubiquitously-expressed nuclear receptor
Type:
Enzyme Catalytic Domain
Mol. Mass.:
50978.79
Organism:
Homo sapiens (Human)
Description:
P55055
Residue:
460
  
Inhibitor
Name:
BDBM50172185
Synonyms:
(1S,4aS,10aR)-6-Hydroxy-1,4a-dimethyl-1,2,3,4,4a,9,10,10a-octahydro-phenanthrene-1-carboxylic acid (adamantan-1-ylmethyl)-amide CHEMBL194642
Type:
Small organic molecule
Emp. Form.:
C28H39NO2
Mol. Mass.:
421.6148
SMILES:
C[C@@]1(CCC[C@@]2(C)[C@H]1CCc1ccc(O)cc21)C(=O)NCC12CC3CC(CC(C3)C1)C2
: