Target
Regulatory protein E2
Ligand
BDBM50035218
Substrate
Meas. Tech.
ChEMBL_532980 (CHEMBL989650)
Kd
70500±n/a nM
Citation
 Saitoh, TKuramochi, KImai, TTakata, KTakehara, MKobayashi, SSakaguchi, KSugawara, F Podophyllotoxin directly binds a hinge domain in E2 of HPV and inhibits an E2/E7 interaction in vitro. Bioorg Med Chem 16:5815-25 (2008)  
Target
Name:
Regulatory protein E2
Synonyms:
E2 VE2_HPV16
Type:
PROTEIN
Mol. Mass.:
41834.37
Organism:
Human papillomavirus type 16
Description:
ChEMBL_532980
Residue:
365
  
Inhibitor
Name:
BDBM50035218
Synonyms:
CHEMBL61 Podophyllinic acid lactone podophyllotoxin
Type:
Small organic molecule
Emp. Form.:
C22H22O8
Mol. Mass.:
414.4053
SMILES:
COc1cc(cc(OC)c1OC)[C@H]1[C@@H]2[C@H](COC2=O)[C@@H](O)c2cc3OCOc3cc12
: