Target
Beta-3 adrenergic receptor
Ligand
BDBM50243341
Substrate
Meas. Tech.
ChEMBL_492276 (CHEMBL947244)
EC50
0.140000±n/a nM
Citation
 Imanishi, MItou, SWashizuka, KHamashima, HNakajima, YAraki, TTomishima, YSakurai, MMatsui, SImamura, EUeshima, KYamamoto, TYamamoto, NIshikawa, HNakano, KUnami, NHamada, KMatsumura, YTakamura, FHattori, K Discovery of a novel series of biphenyl benzoic acid derivatives as highly potent and selective human beta3 adrenergic receptor agonists with good oral bioavailability. Part II. J Med Chem 51:4002-20 (2008)  
Target
Name:
Beta-3 adrenergic receptor
Synonyms:
ADRB3 ADRB3_HUMAN Beta-2 adrenergic receptor and beta-3 adrenergic receptor Beta-3 adrenoreceptor | adrenergic Beta3
Type:
G Protein-Coupled Receptor (GPCR)
Mol. Mass.:
43534.88
Organism:
Homo sapiens (Human)
Description:
Residue:
408
  
Inhibitor
Name:
BDBM50243341
Synonyms:
4-(2-{[(1S,2R)-2-Hydroxy-2-(4-hydroxyphenyl)-1-methylethyl]-amino}ethyl)-3-isopropoxy-4-biphenylcarboxylic acid | CHEMBL510100
Type:
Small organic molecule
Emp. Form.:
C27H31NO5
Mol. Mass.:
449.5387
SMILES:
CC(C)Oc1cc(ccc1C(O)=O)-c1ccc(CCN[C@@H](C)[C@H](O)c2ccc(O)cc2)cc1
: