Target
Beta-3 adrenergic receptor
Ligand
BDBM50243297
Substrate
Meas. Tech.
ChEMBL_492276 (CHEMBL947244)
EC50
0.041000±n/a nM
Citation
 Imanishi, MItou, SWashizuka, KHamashima, HNakajima, YAraki, TTomishima, YSakurai, MMatsui, SImamura, EUeshima, KYamamoto, TYamamoto, NIshikawa, HNakano, KUnami, NHamada, KMatsumura, YTakamura, FHattori, K Discovery of a novel series of biphenyl benzoic acid derivatives as highly potent and selective human beta3 adrenergic receptor agonists with good oral bioavailability. Part II. J Med Chem 51:4002-20 (2008)  
Target
Name:
Beta-3 adrenergic receptor
Synonyms:
ADRB3 ADRB3_HUMAN Beta-2 adrenergic receptor and beta-3 adrenergic receptor Beta-3 adrenoreceptor | adrenergic Beta3
Type:
G Protein-Coupled Receptor (GPCR)
Mol. Mass.:
43534.88
Organism:
Homo sapiens (Human)
Description:
Residue:
408
  
Inhibitor
Name:
BDBM50243297
Synonyms:
4-((2R)-2-{[(2R)-2-Hydroxy-2-phenylethyl]amino}propyl)-3-isobutoxy-4-biphenylcarboxylic acid | CHEMBL453322
Type:
Small organic molecule
Emp. Form.:
C28H33NO4
Mol. Mass.:
447.5659
SMILES:
CC(C)COc1cc(ccc1C(O)=O)-c1ccc(C[C@@H](C)NC[C@H](O)c2ccccc2)cc1
: