Target
Glutamate racemase
Ligand
BDBM50261912
Substrate
Meas. Tech.
ChEMBL_514356 (CHEMBL967970)
IC50
51±n/a nM
Citation
 Basarab, GSHill, PJRastagar, AWebborn, PJ Design of Helicobacter pylori glutamate racemase inhibitors as selective antibacterial agents: a novel pro-drug approach to increase exposure. Bioorg Med Chem Lett 18:4716-22 (2008)  
Target
Name:
Glutamate racemase
Synonyms:
MURI_HELPY murI
Type:
PROTEIN
Mol. Mass.:
28413.39
Organism:
Helicobacter pylori
Description:
ChEMBL_475324
Residue:
255
  
Inhibitor
Name:
BDBM50261912
Synonyms:
2-((6-chloroquinolin-4-yl)methyl)-7-(cyclopropylmethyl)-5-methyl-3-(2-methyl-5-(methylsulfonyl)furan-3-yl)-2H-pyrazolo[3,4-d]pyrimidine-4,6(5H,7H)-dione | CHEMBL469008
Type:
Small organic molecule
Emp. Form.:
C26H24ClN5O5S
Mol. Mass.:
554.017
SMILES:
Cc1oc(cc1-c1n(Cc2ccnc3ccc(Cl)cc23)nc2n(CC3CC3)c(=O)n(C)c(=O)c12)S(C)(=O)=O
: