Target
Glutamate racemase
Ligand
BDBM50215445
Substrate
Meas. Tech.
ChEMBL_514356 (CHEMBL967970)
IC50
26±n/a nM
Citation
 Basarab, GSHill, PJRastagar, AWebborn, PJ Design of Helicobacter pylori glutamate racemase inhibitors as selective antibacterial agents: a novel pro-drug approach to increase exposure. Bioorg Med Chem Lett 18:4716-22 (2008)  
Target
Name:
Glutamate racemase
Synonyms:
MURI_HELPY murI
Type:
PROTEIN
Mol. Mass.:
28413.39
Organism:
Helicobacter pylori
Description:
ChEMBL_475324
Residue:
255
  
Inhibitor
Name:
BDBM50215445
Synonyms:
5-(2-((6-chloroquinolin-4-yl)methyl)-7-(cyclopropylmethyl)-5-methyl-4,6-dioxo-4,5,6,7-tetrahydro-2H-pyrazolo[3,4-d]pyrimidin-3-yl)-1-methyl-1H-pyrrole-3-carbonitrile | CHEMBL257600
Type:
Small organic molecule
Emp. Form.:
C26H22ClN7O2
Mol. Mass.:
499.952
SMILES:
Cn1cc(cc1-c1n(Cc2ccnc3ccc(Cl)cc23)nc2n(CC3CC3)c(=O)n(C)c(=O)c12)C#N
: