Target
Glutamate racemase
Ligand
BDBM50262061
Substrate
Meas. Tech.
ChEMBL_514356 (CHEMBL967970)
IC50
37±n/a nM
Citation
 Basarab, GSHill, PJRastagar, AWebborn, PJ Design of Helicobacter pylori glutamate racemase inhibitors as selective antibacterial agents: a novel pro-drug approach to increase exposure. Bioorg Med Chem Lett 18:4716-22 (2008)  
Target
Name:
Glutamate racemase
Synonyms:
MURI_HELPY murI
Type:
PROTEIN
Mol. Mass.:
28413.39
Organism:
Helicobacter pylori
Description:
ChEMBL_475324
Residue:
255
  
Inhibitor
Name:
BDBM50262061
Synonyms:
2-((6-chloroquinolin-4-yl)methyl)-7-(cyclopropylmethyl)-5-methyl-3-(1-methyl-4-(methylsulfinyl)-1H-pyrrol-2-yl)-2H-pyrazolo[3,4-d]pyrimidine-4,6(5H,7H)-dione | CHEMBL469219
Type:
Small organic molecule
Emp. Form.:
C26H25ClN6O3S
Mol. Mass.:
537.033
SMILES:
Cn1cc(cc1-c1n(Cc2ccnc3ccc(Cl)cc23)nc2n(CC3CC3)c(=O)n(C)c(=O)c12)S(C)=O
: