Target
Estrogen receptor beta
Ligand
BDBM20608
Substrate
Meas. Tech.
ChEMBL_492827 (CHEMBL940316)
IC50
20±n/a nM
Citation
 Barrett, IMeegan, MJHughes, RBCarr, MKnox, AJArtemenko, NGolfis, GZisterer, DMLloyd, DG Synthesis, biological evaluation, structural-activity relationship, and docking study for a series of benzoxepin-derived estrogen receptor modulators. Bioorg Med Chem 16:9554-73 (2008)  
Target
Name:
Estrogen receptor beta
Synonyms:
ER-beta ESR2_HUMAN Estradiol receptor beta (ERβ) Estrogen receptor (ER beta) Estrogen receptor beta (ER beta) NR3A2 estrogen beta
Type:
Protein
Mol. Mass.:
59238.43
Organism:
Homo sapiens (Human)
Description:
Q92731
Residue:
530
  
Inhibitor
Name:
BDBM20608
Synonyms:
4-Hydroxytamoxifen 4-[(1Z)-1-{4-[2-(dimethylamino)ethoxy]phenyl}-2-phenylbut-1-en-1-yl]phenol CHEMBL489 cid_449459
Type:
Small organic molecule
Emp. Form.:
C26H29NO2
Mol. Mass.:
387.514
SMILES:
CC\C(=C(/c1ccc(O)cc1)c1ccc(OCCN(C)C)cc1)c1ccccc1
: