Target
Endothelial lipase
Ligand
BDBM50254339
Substrate
Meas. Tech.
ChEMBL_559992 (CHEMBL1018742)
IC50
130±n/a nM
Citation
 Goodman, KBBury, MJCheung, MCichy-Knight, MADowdell, SEDunn, AKLee, DLieby, JAMoore, MLScherzer, DASha, DSuarez, DPMurphy, DJHarpel, MRManas, ESMcNulty, DEAnnan, RSMatico, RESchwartz, BKTrill, JJSweitzer, TDWang, DYKeller, PMKrawiec, JAJaye, MC Discovery of potent, selective sulfonylfuran urea endothelial lipase inhibitors. Bioorg Med Chem Lett 19:27-30 (2008)  
Target
Name:
Endothelial lipase
Synonyms:
EDL Endothelial cell-derived lipase LIPG
Type:
Protein
Mol. Mass.:
56805.62
Organism:
Homo sapiens (Human)
Description:
Q9Y5X9
Residue:
500
  
Inhibitor
Name:
BDBM50254339
Synonyms:
1-(4-methoxyphenyl)-3-(2-methyl-5-(piperidin-1-ylsulfonyl)furan-3-yl)urea | CHEMBL468071
Type:
Small organic molecule
Emp. Form.:
C18H23N3O5S
Mol. Mass.:
393.457
SMILES:
COc1ccc(NC(=O)Nc2cc(oc2C)S(=O)(=O)N2CCCCC2)cc1
: