Target
Sterol O-acyltransferase 1
Ligand
BDBM50276483
Substrate
Meas. Tech.
ChEMBL_540911 (CHEMBL1027336)
IC50
35±n/a nM
Citation
 Asano, SBan, HKino, KIoriya, KMuraoka, M Novel 1,4-diarylpiperidine-4-methylureas as anti-hyperlipidemic agents: dual effectors on acyl-CoA:cholesterol O-acyltransferase and low-density lipoprotein receptor expression. Bioorg Med Chem Lett 19:1062-5 (2009)  
Target
Name:
Sterol O-acyltransferase 1
Synonyms:
ACACT ACAT Acetyl-CoA acetyltransferase, mitochondrial Acyl-CoA: cholesterol acyltransferase (ACAT) Cholesterol acyltransferase 1 SOAT1 STAT
Type:
Multi-pass membrane protein may form homo- or heterodimers.
Mol. Mass.:
64751.94
Organism:
Homo sapiens (Human)
Description:
P35610
Residue:
550
  
Inhibitor
Name:
BDBM50276483
Synonyms:
1-(2,6-diisopropylphenyl)-3-((4-(3-methoxyphenyl)-1-phenylpiperidin-4-yl)methyl)urea N-(2,6-Diisopropylphenyl)-N'-{[4-(3-methoxyphenyl)-1-phenylpiperidin-4-yl]methyl}urea
Type:
Small organic molecule
Emp. Form.:
C32H41N3O2
Mol. Mass.:
499.6868
SMILES:
COc1cccc(c1)C1(CNC(=O)Nc2c(cccc2C(C)C)C(C)C)CCN(CC1)c1ccccc1
: