Target
Hepatocyte growth factor receptor
Ligand
BDBM50248053
Substrate
Meas. Tech.
ChEMBL_566634 (CHEMBL960948)
IC50
16±n/a nM
Citation
 Raeppel, SClaridge, SSaavedra, OGaudette, FZhan, LMannion, MZhou, NRaeppel, FGranger, MCIsakovic, LDéziel, RNguyen, HBeaulieu, NBeaulieu, CDupont, IRobert, MFLefebvre, SDubay, MRahil, JWang, JSte-Croix, HRobert Macleod, ABesterman, JVaisburg, A N-(3-fluoro-4-(2-arylthieno[3,2-b]pyridin-7-yloxy)phenyl)-2-oxo-3-phenylimidazolidine-1-carboxamides: a novel series of dual c-Met/VEGFR2 receptor tyrosine kinase inhibitors. Bioorg Med Chem Lett 19:1323-8 (2009)  
Target
Name:
Hepatocyte growth factor receptor
Synonyms:
Hepatocyte growth factor receptor Hepatocyte growth factor receptor (c-MET) MET Met proto-oncogene (hepatocyte growth factor receptor) Tyrosine-protein kinase Met (c-Met) c-Met kinase
Type:
Protein
Mol. Mass.:
155559.73
Organism:
Homo sapiens (Human)
Description:
P08581
Residue:
1390
  
Inhibitor
Name:
BDBM50248053
Synonyms:
4-(4-(7-(2-fluoro-4-(2-oxo-3-phenylimidazolidine-1-carboxamido)phenoxy)thieno[3,2-b]pyridin-2-yl)benzyl)-N-methylpiperazine-1-carboxamide | CHEMBL503016
Type:
Small organic molecule
Emp. Form.:
C36H34FN7O4S
Mol. Mass.:
679.763
SMILES:
CNC(=O)N1CCN(Cc2ccc(cc2)-c2cc3nccc(Oc4ccc(NC(=O)N5CCN(C5=O)c5ccccc5)cc4F)c3s2)CC1
: