Target
Retinoic acid receptor gamma
Ligand
BDBM50282693
Substrate
Meas. Tech.
ChEMBL_163481 (CHEMBL772394)
EC50
77±n/a nM
Citation
 Beard, RLGil, DWMarler, DKHenry, EColon, DFGillett, SJArefieg, TBreen, TSKrauss, HDavies, PJChandraratna, RA Structural basis for the differential RXR & RAR activity of stilbene retinoid analogs Bioorg Med Chem Lett 4:1447-1452 (1994)    Article 
Target
Name:
Retinoic acid receptor gamma
Synonyms:
NR1B3 RAR-gamma RARG_HUMAN Retinoic acid receptor gamma | Retinoid receptor
Type:
PROTEIN
Mol. Mass.:
50345.43
Organism:
Homo sapiens (Human)
Description:
ChEMBL_1458016
Residue:
454
  
Inhibitor
Name:
BDBM50282693
Synonyms:
4-[(E)-2-(3-Chloro-5,5,8,8-tetramethyl-5,6,7,8-tetrahydro-naphthalen-2-yl)-propenyl]-benzoic acid | CHEMBL36464
Type:
Small organic molecule
Emp. Form.:
C24H27ClO2
Mol. Mass.:
382.923
SMILES:
C\C(=C/c1ccc(cc1)C(O)=O)c1cc2c(cc1Cl)C(C)(C)CCC2(C)C
: