Target
Squalene synthase
Ligand
BDBM50291314
Substrate
Meas. Tech.
ChEBML_202267
Ki
>250±n/a nM
Citation
 Brown, GRFoubister, AJFreeman, SMcTaggart, FMirrlees, DJReid, ACSmith, GJTaylor, MJThomason, DAWhittamore, PR Novel optimised quinuclidine squalene synthase inhibitors Bioorg Med Chem Lett 7:597-600 (1997)    Article 
Target
Name:
Squalene synthase
Synonyms:
FDFT_RAT Farnesyl-diphosphate farnesyltransferase SQS Squalene synthetase
Type:
PROTEIN
Mol. Mass.:
48109.41
Organism:
Rattus norvegicus
Description:
ChEMBL_1336736
Residue:
416
  
Inhibitor
Name:
BDBM50291314
Synonyms:
3-[3-Allyl-4-(3-hydroxy-1-aza-bicyclo[2.2.2]oct-3-ylethynyl)-phenyl]-propionamide | CHEMBL156006
Type:
Small organic molecule
Emp. Form.:
C21H26N2O2
Mol. Mass.:
338.4433
SMILES:
NC(=O)CCc1ccc(C#CC2(O)CN3CCC2CC3)c(CC=C)c1
: