Target
Hepatocyte growth factor receptor
Ligand
BDBM50303273
Substrate
Meas. Tech.
ChEMBL_595362 (CHEMBL1050655)
IC50
25±n/a nM
Citation
 Saavedra, OClaridge, SZhan, LRaeppel, FGranger, MCRaeppel, SMannion, MGaudette, FZhou, NIsakovic, LBernstein, NDéziel, RNguyen, HBeaulieu, NBeaulieu, CDupont, IWang, JMacleod, ARBesterman, JMVaisburg, A N3-arylmalonamides: a new series of thieno[3,2-b]pyridine based inhibitors of c-Met and VEGFR2 tyrosine kinases. Bioorg Med Chem Lett 19:6836-9 (2009)  
Target
Name:
Hepatocyte growth factor receptor
Synonyms:
Hepatocyte growth factor receptor Hepatocyte growth factor receptor (c-MET) MET Met proto-oncogene (hepatocyte growth factor receptor) Tyrosine-protein kinase Met (c-Met) c-Met kinase
Type:
Protein
Mol. Mass.:
155559.73
Organism:
Homo sapiens (Human)
Description:
P08581
Residue:
1390
  
Inhibitor
Name:
BDBM50303273
Synonyms:
CHEMBL566844 | N1-(4-(2-(1-ethyl-1H-imidazole-4-carbonyl)thieno[3,2-b]pyridin-7-yloxy)-3-fluorophenyl)-N3-(2-methoxyphenyl)malonamide
Type:
Small organic molecule
Emp. Form.:
C28H24FN5O4S
Mol. Mass.:
545.585
SMILES:
CCn1cnc(c1)-c1cc2nccc(Oc3ccc(NC(=O)CC(=O)Nc4ccccc4OC)cc3F)c2s1
: