Target
Caspase-1
Ligand
BDBM50303441
Substrate
Meas. Tech.
ChEMBL_595869 (CHEMBL1040853)
IC50
70794.58±n/a nM
Citation
 Mott, BTFerreira, RSSimeonov, AJadhav, AAng, KKLeister, WShen, MSilveira, JTDoyle, PSArkin, MRMcKerrow, JHInglese, JAustin, CPThomas, CJShoichet, BKMaloney, DJ Identification and optimization of inhibitors of Trypanosomal cysteine proteases: cruzain, rhodesain, and TbCatB. J Med Chem 53:52-60 (2010)  
Target
Name:
Caspase-1
Synonyms:
CASP1 Caspase ICE IL1BCE Interleukin-1 beta-converting enzyme
Type:
Enzyme
Mol. Mass.:
45154.13
Organism:
Homo sapiens (Human)
Description:
P29466
Residue:
404
  
Inhibitor
Name:
BDBM50303441
Synonyms:
9-(3,5-Difluorophenyl)-6-(ethylamino)-9H-purine-2-carbonitrile | CHEMBL567134
Type:
Small organic molecule
Emp. Form.:
C14H10F2N6
Mol. Mass.:
300.2662
SMILES:
CCNc1nc(nc2n(cnc12)-c1cc(F)cc(F)c1)C#N
: