Target
Cathepsin Z
Ligand
BDBM50303436
Substrate
Meas. Tech.
ChEMBL_595889 (CHEMBL1040869)
IC50
14791.08±n/a nM
Citation
 Mott, BTFerreira, RSSimeonov, AJadhav, AAng, KKLeister, WShen, MSilveira, JTDoyle, PSArkin, MRMcKerrow, JHInglese, JAustin, CPThomas, CJShoichet, BKMaloney, DJ Identification and optimization of inhibitors of Trypanosomal cysteine proteases: cruzain, rhodesain, and TbCatB. J Med Chem 53:52-60 (2010)  
Target
Name:
Cathepsin Z
Synonyms:
CATZ_HUMAN Cathepsin P | Cathepsin X
Type:
PROTEIN
Mol. Mass.:
33870.59
Organism:
Homo sapiens (Human)
Description:
ChEMBL_595889
Residue:
303
  
Inhibitor
Name:
BDBM50303436
Synonyms:
9-(2,2-difluoroethyl)-6-(3,5-difluorophenylamino)-9H-purine-2-carbonitrile | CHEMBL578159
Type:
Small organic molecule
Emp. Form.:
C14H8F4N6
Mol. Mass.:
336.2471
SMILES:
FC(F)Cn1cnc2c(Nc3cc(F)cc(F)c3)nc(nc12)C#N
: