Target
Free fatty acid receptor 2
Ligand
BDBM50074329
Substrate
Meas. Tech.
ChEMBL_605612 (CHEMBL1069216)
IC50
120000±n/a nM
Citation
 Wang, YJiao, XKayser, FLiu, JWang, ZWanska, MGreenberg, JWeiszmann, JGe, HTian, HWong, SSchwandner, RLee, TLi, Y The first synthetic agonists of FFA2: Discovery and SAR of phenylacetamides as allosteric modulators. Bioorg Med Chem Lett 20:493-8 (2010)  
Target
Name:
Free fatty acid receptor 2
Synonyms:
FFA2 FFAR2_HUMAN GPCR43 | GPR43
Type:
PROTEIN
Mol. Mass.:
37156.44
Organism:
Homo sapiens (Human)
Description:
ChEMBL_1508993
Residue:
330
  
Inhibitor
Name:
BDBM50074329
Synonyms:
CH3-COOH Essigsaeure HOAc acetic acid ethoic acid
Type:
Small organic molecule
Emp. Form.:
C2H4O2
Mol. Mass.:
60.052
SMILES:
CC(O)=O
: