Target
Vascular endothelial growth factor receptor 2
Ligand
BDBM50248556
Substrate
Meas. Tech.
ChEMBL_610267 (CHEMBL1067992)
IC50
20±n/a nM
Citation
 Gaudette, FRaeppel, SNguyen, HBeaulieu, NBeaulieu, CDupont, IMacleod, ARBesterman, JMVaisburg, A Identification of potent and selective VEGFR receptor tyrosine kinase inhibitors having new amide isostere headgroups. Bioorg Med Chem Lett 20:848-52 (2010)  
Target
Name:
Vascular endothelial growth factor receptor 2
Synonyms:
CD_antigen=CD309 Fetal liver kinase 1 (FLK-1) KDR Protein-tyrosine kinase receptor Flk-1 VEGFR-2 VEGFR2 Vascular Endothelial Growth Factor Receptor Kinase 2 Vascular endothelial growth factor receptor 2 (KDR) Vascular endothelial growth factor receptor 2 (VEGFR2) Vascular endothelial growth factor receptor-2 (VEGFR-2)
Type:
Receptor Tyrosine Kinase
Mol. Mass.:
151510.97
Organism:
Homo sapiens (Human)
Description:
P35968
Residue:
1356
  
Inhibitor
Name:
BDBM50248556
Synonyms:
CHEMBL464510 | N1-(3-fluoro-4-(2-(1-methyl-1H-imidazol-4-yl)thieno[3,2-b]pyridin-7-yloxy)phenyl)-N3-phenylmalonamide
Type:
Small organic molecule
Emp. Form.:
C26H20FN5O3S
Mol. Mass.:
501.532
SMILES:
Cn1cnc(c1)-c1cc2nccc(Oc3ccc(NC(=O)CC(=O)Nc4ccccc4)cc3F)c2s1
: