Target
3-phosphoinositide-dependent protein kinase 1
Ligand
BDBM50316351
Substrate
Meas. Tech.
ChEMBL_627903 (CHEMBL1103719)
IC50
3±n/a nM
Citation
 Nittoli, TDushin, RGIngalls, CCheung, KFloyd, MBFraser, HOlland, AHu, YGrosu, GHan, XArndt, KGuo, BWissner, A The identification of 8,9-dimethoxy-5-(2-aminoalkoxy-pyridin-3-yl)-benzo[c][2,7]naphthyridin-4-ylamines as potent inhibitors of 3-phosphoinositide-dependent kinase-1 (PDK-1). Eur J Med Chem 45:1379-86 (2010)  
Target
Name:
3-phosphoinositide-dependent protein kinase 1
Synonyms:
3-Phosphoinositide-Dependent Protein Kinase 1 (PDK1) 3-phosphoinositide-dependent protein kinase 1 3-phosphoinositide-dependent protein kinase 1 (PDK-1) Isoform 2 of 3-phosphoinositide-dependent protein kinase 1 PDPK1 Phosphoinositide-dependent protein kinase 1 (PDK1) hPDK1
Type:
Enzyme
Mol. Mass.:
63157.65
Organism:
Homo sapiens (Human)
Description:
O15530
Residue:
556
  
Inhibitor
Name:
BDBM50316351
Synonyms:
2-(5-{[(2S)-2-Amino-3-(4-fluorophenyl)propyl]oxy}pyridin-3-yl)-8,9-dimethoxybenzo[c]-2,7-naphthyridin-4-amine | CHEMBL1095621
Type:
Small organic molecule
Emp. Form.:
C28H26FN5O3
Mol. Mass.:
499.5361
SMILES:
COc1cc2ncc3c(N)nc(cc3c2cc1OC)-c1cncc(OC[C@@H](N)Cc2ccc(F)cc2)c1
: